{"text_format":"1","workbook":"xlsx","n_sheets":4,"sheets":["Input Form","Print Form","Data","Lists"],"not_rendered":{"charts":0,"images":1,"macros":1,"external_links":1,"defined_names":15,"comments":0,"pivot_tables":0},"unopened":[],"bounds":{"document_bytes":16777216,"sheet_cells":100000,"rows_first":2000,"rows_last":500,"rows_between":2000,"halvings":0,"cell_chars":16384,"cell_head_chars":4096},"cells_cut":0,"cells_raw":0,"read":"whole","date_system":"1900"}

{"sheet":"Input Form","index":0,"n_rows":71,"n_cols":29,"rows_kept":71,"cut":false,"hidden":false,"merged":[[0,0,4,14],[5,0,5,14],[13,2,13,3],[43,2,43,3],[37,7,39,10],[40,7,40,10],[42,2,42,3],[6,2,6,3],[11,2,11,3],[12,2,12,3],[8,2,8,3],[10,5,10,12],[11,5,11,12],[12,5,14,5],[14,15,14,16],[6,0,6,1],[7,0,8,1],[53,7,53,8],[12,6,14,13],[7,2,7,3],[9,2,9,3],[10,2,10,3],[38,11,43,14],[6,5,6,12],[14,2,14,4],[37,2,39,5],[40,2,40,5],[7,5,7,12],[8,5,8,12],[9,5,9,12]]}
["Vocational-Technical Education Transportation\n Reimbursement Form FY13\nV.S.A. Title 16: Education, Chapter 37: Technical Training, Subchapter V., § 1563. Transportation Assistance\n as amended by Sec. 7 of Act 66 of the 2007 Legislative Session",null,null,null,null,null,null,null,null,null,null,null,null,null,null,null,null,null,null,null,null,"Visibility Flag1",{"$f":"IF(N9=\"\",1,IF($N$9=\"District Operated\",1,0))","v":1},null,null,"Detail Flag",{"$f":"IF(OR(Q17=\"No\",Q18=\"No\",Q19=\"No\",Q20=\"No\",Q21=\"No\",Q22=\"No\",Q23=\"No\",Q24=\"No\",Q25=\"No\",Q26=\"No\",Q27=\"No\",Q28=\"No\",Q29=\"No\",Q30=\"No\",Q31=\"No\",Q32=\"No\",Q33=\"No\",Q34=\"No\",Q35=\"No\",Q36=\"No\"),0,1)","v":0},null,"<---Hidden Columns"]
[null,null,null,null,null,null,null,null,null,null,null,null,null,null,null,null,null,null,null,null,null,"Visibility Flag2",{"$f":"IF(OR($N$9=\"District Operated\",$N$9=\"Reimbursement\"),1,0)","v":0},null,null,"Internal Flag",{"$f":"IF(N9=\"\",0,IF(N9=\"District Operated\",IF(OR(E7=\"\",E8=\"\",E11=\"\",E12=\"\",E13=\"\",E14=\"\",N7=\"\",N8=\"\",N9=\"\",C43=\"\",E43=\"\",F43=\"\"),0,1),1))","v":0}]
[null,null,null,null,null,null,null,null,null,null,null,null,null,null,null,null,null,null,null,null,null,"Submittable Flag",{"$f":"IF(AND(AA1=1,AA2=1,AA3=1,AA4=1),1,0)","v":0},null,null,"Reimbursement Flag",{"$f":"IF(N9=\"Reimbursement\",IF(OR(E7=\"\",E8=\"\",E11=\"\",E12=\"\",E13=\"\",E14=\"\",N7=\"\",N8=\"\",N9=\"\",N10=\"\",C43=\"\",E43=\"\",F43=\"\"),0,1),1)","v":1}]
[null,null,null,null,null,null,null,null,null,null,null,null,null,null,null,null,null,null,null,null,null,null,null,null,null,"Contract Flag",{"$f":"IF(LEFT(N9,8)=\"Contract\",IF(OR(E7=\"\",E8=\"\",E11=\"\",E12=\"\",E13=\"\",E14=\"\",N7=\"\",N8=\"\",N9=\"\",N10=\"\",N11=\"\",N12=\"\",C43=\"\",E43=\"\",F43=\"\"),0,1),1)","v":1}]
[null,null,null,null,null,null,null,null,null,null,null,null,null,null,null,null,null,null,null,null,"Filename:",{"$f":"E9&\" Sem \"&E11&\" SY \"&E12","v":" Sem  SY "}]
[]
["Status",null,"School District Type:",null,null,"Estimated Number of days Transportation is provided to the Tech Ctr this year?",null,null,null,null,null,null,null,null,"TARF ID",null,null,null,null,null,"Subject:",{"$f":"V5&\" Tech Ed Transportation form\"","v":" Sem  SY  Tech Ed Transportation form"}]
[{"$f":"IF(W3=1,\"Submittable\",\"Incomplete\")","v":"Incomplete"},null,"School District:",null,null,{"$f":"\"Previous Year's Semester \"&E11&\" Actual Cost:\"","v":"Previous Year's Semester  Actual Cost:"}]
[null,null,"LEA ID:",null,{"$f":"IF(E8=\"\",\"\",VLOOKUP(E8,Lists!$C$6:$D$179,2,FALSE))","v":""},"How is Tech Ed transportation paid?",null,null,null,null,null,null,null,null,"Form ID"]
[null,null,"Fiscal Year:",null,"2013",{"$f":"IF($N$9=\"Contract by Trip\",\"What is the contracted per Trip Rate?\",IF($N$9=\"Reimbursement\",\"What is the Reimbursement Rate?\",IF($N$9=\"Contract by Mile\",\"What is the contracted per Mile Rate?\",\"\")))","v":""},null,null,null,null,null,null,null,null,{"$f":"E9&E11&E12","v":""}]
[null,null,"Semester:",null,null,{"$f":"IF($N$9=\"Contract by Trip\",\"Who do you contract with?\",IF($N$9=\"Reimbursement\",\"\",IF($N$9=\"Contract by Mile\",\"Who do you contract with?\",\"\")))","v":""},null,null,null,null,null,null,null,null,"Per mile Est."]
[null,null,"School Year:",null,null,{"$f":"IF($N$9=\"Contract by Trip\",\"How much is the \"&E12&\" contract for all Tech Ed Buses?\",IF($N$9=\"Reimbursement\",\"\",IF($N$9=\"Contract by Mile\",\"How much is the \"&E12&\" contract for all Tech Ed Buses?\",\"\")))","v":""},null,null,null,null,null,null,null,null,{"$f":"IF(A8=\"Submittable\",IF(ISERROR(Data!S34*1=TRUE),0,Data!S34),0)","v":0}]
[null,null,"Superintendent:",null,null,{"$f":"IF(OR(E9=\"P005\",E9=\"J242\"),\"Please fill out the table below the form\",\"\")","v":""}]
[null,null,"Supervisory Union:"]
[null,null,null,null,null,null,null,null,null,null,null,null,null,null,null,"Does not Print"]
["Line","Vehicle #","Driver's Name","Vehicle Capacity","Trip Type","Technical Center","Number of one-way trips each day","Number of miles per one-way trip each day","Number of Technical Education Students\n(Residents)","Technical Education Students\n(Non-Residents)","Number of other Students","Estimated number of days this vehicle will travel in this Semester","% Reimbursed","Paid Rate","Estimated Payment",{"$f":"IF(N9=\"Contract by trip\",\"Please convert the by trip rate to a per mile rate\",IF(N10=\"Multiple\",\"Contract/ Reimbursement Custom Rates\",\"Do Not use this column\"))","v":"Do Not use this column"},"Is Row Complete?"]
[1,null,null,null,null,null,null,null,null,null,null,null,{"$f":"IF(G17>0,IF(I17+J17+K17=0,1,IF(ROUND((I17+J17)/(I17+J17+K17),4)>=0.5,1,ROUND((I17+J17)/(I17+J17+K17),4))),\"\")","v":""},{"$f":"IF(Q17=\"No\",0,IF(G17=\"\",\"\",IF($N$9=\"Contract by trip\",MIN(Data!$D$6,$P$17),IF(ISERROR(MIN(Data!$D$6,'Input Form'!$N$10,P17))=TRUE,\"\",MIN(Data!$D$6,'Input Form'!$N$10,P17)))))","v":0},{"$f":"IF(ISERROR(IF(G17>0,G17*H17*M17*L17*N17,\"\"))=TRUE,\"\",IF(G17>0,ROUND(G17*H17*M17*L17*N17,2),\"\"))","v":""},null,{"$f":"IF(AND(N9=\"Contract by trip\",$P$17=\"\"),\"No\",IF(AND(A17=1,G17=\"\"),\"No\",IF(AND($N$10=\"Multiple\",G17>0,P17=\"\"),\"No\",IF(OR(B17<>\"\",C17<>\"\",D17<>\"\",E17<>\"\",F17<>\"\",G17<>\"\",H17<>\"\",I17<>\"\",K17<>\"\",L17<>\"\"),IF(OR(B17=\"\",C17=\"\",F17=\"\",D17=\"\",E17=\"\",H17=\"\",I17=\"\",K17=\"\",L17=\"\"),\"No\",\"Yes\"),\"\"))))","v":"No"}]
[{"$f":"+A17+1","v":2},null,null,null,null,null,null,null,null,null,null,null,{"$f":"IF(G18>0,IF(I18+J18+K18=0,1,IF(ROUND((I18+J18)/(I18+J18+K18),4)>=0.5,1,ROUND((I18+J18)/(I18+J18+K18),4))),\"\")","v":""},{"$f":"IF(Q18=\"No\",0,IF(G18=\"\",\"\",IF($N$9=\"Contract by trip\",MIN(Data!$D$6,$P$17),IF(ISERROR(MIN(Data!$D$6,'Input Form'!$N$10,P18))=TRUE,\"\",MIN(Data!$D$6,'Input Form'!$N$10,P18)))))","v":""},{"$f":"IF(ISERROR(IF(G18>0,G18*H18*M18*L18*N18,\"\"))=TRUE,\"\",IF(G18>0,ROUND(G18*H18*M18*L18*N18,2),\"\"))","v":""},null,{"$f":"IF(AND(N10=\"Contract by trip\",$P$17=\"\"),\"No\",IF(AND(A18=1,G18=\"\"),\"No\",IF(AND($N$10=\"Multiple\",G18>0,P18=\"\"),\"No\",IF(OR(B18<>\"\",C18<>\"\",D18<>\"\",E18<>\"\",F18<>\"\",G18<>\"\",H18<>\"\",I18<>\"\",K18<>\"\",L18<>\"\"),IF(OR(B18=\"\",C18=\"\",F18=\"\",D18=\"\",E18=\"\",H18=\"\",I18=\"\",K18=\"\",L18=\"\"),\"No\",\"Yes\"),\"\"))))","v":""}]
[{"$f":"+A18+1","v":3},null,null,null,null,null,null,null,null,null,null,null,"",{"$f":"IF(Q19=\"No\",0,IF(G19=\"\",\"\",IF($N$9=\"Contract by trip\",MIN(Data!$D$6,$P$17),IF(ISERROR(MIN(Data!$D$6,'Input Form'!$N$10,P19))=TRUE,\"\",MIN(Data!$D$6,'Input Form'!$N$10,P19)))))","v":""},"",null,""]
[4,null,null,null,null,null,null,null,null,null,null,null,"",{"$f":"IF(Q20=\"No\",0,IF(G20=\"\",\"\",IF($N$9=\"Contract by trip\",MIN(Data!$D$6,$P$17),IF(ISERROR(MIN(Data!$D$6,'Input Form'!$N$10,P20))=TRUE,\"\",MIN(Data!$D$6,'Input Form'!$N$10,P20)))))","v":""},"",null,""]
{"$rows_left_out":52}
{"sheet":"Print Form","index":1,"n_rows":44,"n_cols":15,"rows_kept":44,"cut":false,"hidden":false,"merged":[[7,0,8,1],[8,2,8,3],[7,2,7,3],[7,5,7,12],[8,5,8,12],[0,0,4,14],[5,0,5,14],[6,0,6,1],[6,2,6,3],[6,5,6,12],[9,2,9,3],[10,2,10,3],[11,2,11,3],[9,5,9,12],[10,5,10,12],[11,5,11,12],[40,2,40,5],[12,2,12,3],[12,6,14,13],[13,2,13,3],[37,7,39,10],[38,11,43,14],[40,7,40,10],[42,2,42,3],[43,2,43,3],[12,5,14,5],[14,2,14,4],[37,2,39,5]]}
["Vocational-Technical Education Transportation\n Reimbursement Form FY12\nV.S.A. Title 16: Education, Chapter 37: Technical Training, Subchapter V., § 1563. Transportation Assistance\n as amended by Sec. 7 of Act 66 of the 2007 Legislative Session"]
[]
[]
[]
[]
[]
["Status",null,"School District Type:",null,{"$f":"'Input Form'!E7","v":0},"Estimated Number of days Transportation is provided to the Tech Ctr this year?",null,null,null,null,null,null,null,{"$f":"'Input Form'!N7","v":0},"TARF ID"]
[{"$f":"+'Input Form'!A8:B9","v":"Incomplete"},null,"School District:",null,{"$f":"'Input Form'!E8","v":0},{"$f":"\"Previous Year's Semester \"&E11&\" Actual Cost:\"","v":"Previous Year's Semester 0 Actual Cost:"},null,null,null,null,null,null,null,{"$f":"'Input Form'!N8","v":0}]
[null,null,"LEA ID:",null,{"$f":"'Input Form'!E9","v":""},"How is Tech Ed transportation paid?",null,null,null,null,null,null,null,{"$f":"'Input Form'!N9","v":0},"Form ID"]
[null,null,"Fiscal Year:",null,{"$f":"'Input Form'!E10","v":"2013"},{"$f":"IF($N$9=\"Contract by Trip\",\"What is the contracted per Trip Rate?\",IF($N$9=\"Reimbursement\",\"What is the Reimbursement Rate?\",IF($N$9=\"Contract by Mile\",\"What is the contracted per Mile Rate?\",\"\")))","v":""},null,null,null,null,null,null,null,{"$f":"IF('Input Form'!N10=\"\",\"\",'Input Form'!N10)","v":""},{"$f":"+'Input Form'!O10","v":""}]
[null,null,"Semester:",null,{"$f":"'Input Form'!E11","v":0},{"$f":"IF($N$9=\"Contract by Trip\",\"Who do you contract with?\",IF($N$9=\"Reimbursement\",\"\",IF($N$9=\"Contract by Mile\",\"Who do you contract with?\",\"\")))","v":""},null,null,null,null,null,null,null,{"$f":"IF('Input Form'!N11=\"\",\"\",'Input Form'!N11)","v":""},"Per mile Est."]
[null,null,"School Year:",null,{"$f":"'Input Form'!E12","v":0},{"$f":"IF($N$9=\"Contract by Trip\",\"How much is the \"&E12&\" contract for all Tech Ed Buses?\",IF($N$9=\"Reimbursement\",\"\",IF($N$9=\"Contract by Mile\",\"How much is the \"&E12&\" contract for all Tech Ed Buses?\",\"\")))","v":""},null,null,null,null,null,null,null,{"$f":"IF('Input Form'!N12=\"\",\"\",'Input Form'!N12)","v":""},{"$f":"'Input Form'!O12","v":0}]
[null,null,"Superintendent:",null,{"$f":"'Input Form'!E13","v":0},"Mail Signed form to:","Sean Cousino\nVermont Department of Education\nSchool Finance\n120 State Street\nMontpelier VT 05620"]
[null,null,"Supervisory Union:",null,{"$f":"'Input Form'!E14","v":0}]
[]
["Line","Vehicle #","Driver's Name","Vehicle Capacity","Trip Type","Technical Center","Number of One-way trips each day","Number of miles per one-way trip each day","Number of Technical Education Students\n(Residents)","Technical Education Students\n(Non-Residents)","Number of other Students","Estimated num. of days this vehicle will travel in this semester","% Reimbursed","Paid Rate","Estimated Payment"]
[1,{"$f":"IF('Input Form'!B17=\"\",\"\",'Input Form'!B17)","v":""},{"$f":"IF('Input Form'!C17=\"\",\"\",'Input Form'!C17)","v":""},{"$f":"IF('Input Form'!D17=\"\",\"\",'Input Form'!D17)","v":""},{"$f":"IF('Input Form'!E17=\"\",\"\",'Input Form'!E17)","v":""},{"$f":"IF('Input Form'!F17=\"\",\"\",'Input Form'!F17)","v":""},{"$f":"IF('Input Form'!G17=\"\",\"\",'Input Form'!G17)","v":""},{"$f":"IF('Input Form'!H17=\"\",\"\",'Input Form'!H17)","v":""},{"$f":"IF('Input Form'!I17=\"\",\"\",'Input Form'!I17)","v":""},{"$f":"IF('Input Form'!J17=\"\",\"\",'Input Form'!J17)","v":""},{"$f":"IF('Input Form'!K17=\"\",\"\",'Input Form'!K17)","v":""},{"$f":"IF('Input Form'!L17=\"\",\"\",'Input Form'!L17)","v":""},{"$f":"IF('Input Form'!M17=\"\",\"\",'Input Form'!M17)","v":""},{"$f":"IF('Input Form'!N17=\"\",\"\",'Input Form'!N17)","v":0},{"$f":"IF('Input Form'!O17=\"\",\"\",'Input Form'!O17)","v":""}]
[{"$f":"+A17+1","v":2},{"$f":"IF('Input Form'!B18=\"\",\"\",'Input Form'!B18)","v":""},{"$f":"IF('Input Form'!C18=\"\",\"\",'Input Form'!C18)","v":""},{"$f":"IF('Input Form'!D18=\"\",\"\",'Input Form'!D18)","v":""},{"$f":"IF('Input Form'!E18=\"\",\"\",'Input Form'!E18)","v":""},{"$f":"IF('Input Form'!F18=\"\",\"\",'Input Form'!F18)","v":""},{"$f":"IF('Input Form'!G18=\"\",\"\",'Input Form'!G18)","v":""},{"$f":"IF('Input Form'!H18=\"\",\"\",'Input Form'!H18)","v":""},{"$f":"IF('Input Form'!I18=\"\",\"\",'Input Form'!I18)","v":""},{"$f":"IF('Input Form'!J18=\"\",\"\",'Input Form'!J18)","v":""},{"$f":"IF('Input Form'!K18=\"\",\"\",'Input Form'!K18)","v":""},{"$f":"IF('Input Form'!L18=\"\",\"\",'Input Form'!L18)","v":""},{"$f":"IF('Input Form'!M18=\"\",\"\",'Input Form'!M18)","v":""},{"$f":"IF('Input Form'!N18=\"\",\"\",'Input Form'!N18)","v":""},{"$f":"IF('Input Form'!O18=\"\",\"\",'Input Form'!O18)","v":""}]
[{"$f":"+A18+1","v":3},{"$f":"IF('Input Form'!B19=\"\",\"\",'Input Form'!B19)","v":""},{"$f":"IF('Input Form'!C19=\"\",\"\",'Input Form'!C19)","v":""},{"$f":"IF('Input Form'!D19=\"\",\"\",'Input Form'!D19)","v":""},{"$f":"IF('Input Form'!E19=\"\",\"\",'Input Form'!E19)","v":""},{"$f":"IF('Input Form'!F19=\"\",\"\",'Input Form'!F19)","v":""},{"$f":"IF('Input Form'!G19=\"\",\"\",'Input Form'!G19)","v":""},{"$f":"IF('Input Form'!H19=\"\",\"\",'Input Form'!H19)","v":""},{"$f":"IF('Input Form'!I19=\"\",\"\",'Input Form'!I19)","v":""},{"$f":"IF('Input Form'!J19=\"\",\"\",'Input Form'!J19)","v":""},{"$f":"IF('Input Form'!K19=\"\",\"\",'Input Form'!K19)","v":""},{"$f":"IF('Input Form'!L19=\"\",\"\",'Input Form'!L19)","v":""},{"$f":"IF('Input Form'!M19=\"\",\"\",'Input Form'!M19)","v":""},{"$f":"IF('Input Form'!N19=\"\",\"\",'Input Form'!N19)","v":""},{"$f":"IF('Input Form'!O19=\"\",\"\",'Input Form'!O19)","v":""}]
[4,{"$f":"IF('Input Form'!B20=\"\",\"\",'Input Form'!B20)","v":""},{"$f":"IF('Input Form'!C20=\"\",\"\",'Input Form'!C20)","v":""},{"$f":"IF('Input Form'!D20=\"\",\"\",'Input Form'!D20)","v":""},{"$f":"IF('Input Form'!E20=\"\",\"\",'Input Form'!E20)","v":""},{"$f":"IF('Input Form'!F20=\"\",\"\",'Input Form'!F20)","v":""},{"$f":"IF('Input Form'!G20=\"\",\"\",'Input Form'!G20)","v":""},{"$f":"IF('Input Form'!H20=\"\",\"\",'Input Form'!H20)","v":""},{"$f":"IF('Input Form'!I20=\"\",\"\",'Input Form'!I20)","v":""},{"$f":"IF('Input Form'!J20=\"\",\"\",'Input Form'!J20)","v":""},{"$f":"IF('Input Form'!K20=\"\",\"\",'Input Form'!K20)","v":""},{"$f":"IF('Input Form'!L20=\"\",\"\",'Input Form'!L20)","v":""},{"$f":"IF('Input Form'!M20=\"\",\"\",'Input Form'!M20)","v":""},{"$f":"IF('Input Form'!N20=\"\",\"\",'Input Form'!N20)","v":""},{"$f":"IF('Input Form'!O20=\"\",\"\",'Input Form'!O20)","v":""}]
{"$rows_left_out":25}
{"sheet":"Data","index":2,"n_rows":58,"n_cols":27,"rows_kept":58,"cut":false,"hidden":true,"merged":[]}
["Fiscal Year:","School Year:","Thetford Academy","Semester:","Vehicle/Run #","Driver's Name:","Technical Center:",null,null,null,null,null,"Estimated number of days this vehicle will Travel to the Tech Ctr this year?","Estimated number of days this \nvehicle will travel in this semester:","If transportation is contracted what \nis the per mile amount that you pay:",0,"Preparer's Name","Preparer's contact: E-mail                           Phone #",null,null,"Lea-FY-Sem-SemFY-Bus#","Phone Number"]
["txtFiscalYear","txtSemFiscalYear","txtSchoolDistirct","txtSemester","txtBusNumber","txtDriver","txtTechnicalCenter","dblOneWayMileage","intNumOneWayTrips","intTotalStudents","intTotalNonTechStudents","intDaysInSession","intDaysBusTraveled","dblContractRate","dblReimbursementRate","txtPreparersName","txtPeparersEmail","strSourceFile","txtLEA","txtTransid","strPhoneNumber","dblPrelimAmount","intYearlyContractAmount","intBusCapacity","intPYCosts"]
[{"$f":"'Input Form'!E10","v":"2013"},{"$f":"RIGHT('Input Form'!E12,4)","v":""},{"$f":"'Input Form'!E8","v":0},{"$f":"'Input Form'!E11","v":0},null,null,null,null,null,null,null,{"$f":"'Input Form'!N7","v":0},null,{"$f":"IF('Input Form'!N9=\"Reimbursement\",0,'Input Form'!N10)","v":0},{"$f":"IF('Input Form'!N9=\"Reimbursement\",'Input Form'!N10,0)","v":0},{"$f":"+'Input Form'!C43","v":0},{"$f":"'Input Form'!E43","v":0},{"$f":"\"J:\\FY\"&A3&\"\\Sean\"&RIGHT(A3,2)&\"\\Tech Ed\\Transportation\\Transportation Reimbursement Form\\To Be Loaded\\Loaded\\\"&\"\"&MID(CELL(\"filename\",P3),FIND(\"[\",CELL(\"filename\",P3))+1,(LEN(\"\"&MID(CELL(\"filename\",P3),FIND(\"[\",CELL(\"filename\",P3))+1,256))-LEN(\"\"&MID(CELL(\"filename\",P3),FIND(\"]\",CELL(\"filename\",P3))+1,256)))-1)&\"#\"&\"J:\\FY\"&A3&\"\\Sean\"&RIGHT(A3,2)&\"\\Tech Ed\\Transportation\\Transportation Reimbursement Form\\To Be Loaded\\Loaded\\\"&\"\"&MID(CELL(\"filename\",P3),FIND(\"[\",CELL(\"filename\",P3))+1,(LEN(\"\"&MID(CELL(\"filename\",P3),FIND(\"[\",CELL(\"filename\",P3))+1,256))-LEN(\"\"&MID(CELL(\"filename\",P3),FIND(\"]\",CELL(\"filename\",P3))+1,256)))-1)&\"#\"","v":"J:\\FY2013\\Sean13\\Tech Ed\\Transportation\\Transportation Reimbursement Form\\To Be Loaded\\Loaded\\FY2013 Tech Ed Transportation Form v5.1.xlsm#J:\\FY2013\\Sean13\\Tech Ed\\Transportation\\Transportation Reimbursement Form\\To Be Loaded\\Loaded\\FY2013 Tech Ed Transportation Form v5.1.xlsm#"},{"$f":"'Input Form'!E9","v":""},{"$f":"S3&D3&B3&E3","v":"0"},{"$f":"'Input Form'!F43","v":0},{"$f":"R32","v":0},{"$f":"'Input Form'!N12","v":0},null,{"$f":"'Input Form'!N8","v":0}]
[]
[]
[null,null,"State Rate",{"$f":"VLOOKUP('Input Form'!E12,Lists!$K$6:$L$7,2,FALSE)","v":{"$error":"#N/A"}},null,null,null,null,null,null,null,null,null,null,null,"Factor"]
[null,null,null,null,null,null,null,null,null,null,null,null,null,null,null,">0"]
[null,null,null,null,null,null,null,null,null,null,null,null,null,null,null,null,null,null,null,null,null,null,null,"J:\\FY2009\\Sean09\\Tech Ed\\Transportation\\Transportation Reimbursement Form\\To Be Loaded"]
[null,null,null,null,null,null,null,null,null,null,null,null,null,null,null,null,"old"]
[null,null,null,null,null,null,null,null,null,null,null,null,null,null,"Total Days",null,{"$f":"Q3","v":0},null,"Total"]
["txtTripType","txtTechCenterM","txtBusNumber","txtDriver","intCapacity","intDaysTrav","intPaidRate","intTripType","intOneWayTrips","dblMilesPerTrip","intTechStudents","intNRStudents","intOtherStudents","txtTransid","txtTransidCT","Total Trips",{"$f":"SUM(I12:I17)","v":0},null,null,"Miles"]
[{"$f":"'Input Form'!E17","v":0},{"$f":"'Input Form'!F17","v":0},{"$f":"'Input Form'!B17","v":0},{"$f":"'Input Form'!C17","v":0},{"$f":"'Input Form'!D17","v":0},{"$f":"'Input Form'!L17","v":0},{"$f":"'Input Form'!N17","v":0},{"$f":"LEFT(A12,1)","v":"0"},{"$f":"'Input Form'!G17","v":0},{"$f":"'Input Form'!H17","v":0},{"$f":"'Input Form'!I17","v":0},{"$f":"'Input Form'!J17","v":0},{"$f":"'Input Form'!K17","v":0},{"$f":"IF(I12=0,\"-\",$T$3)","v":"-"},{"$f":"IF(N12=\"-\",\"-\",N12&G39)","v":"-"},"One-Way Mileage",{"$f":"IF(SUM(J12:J17)=0,0,SUM(J12:J17)/COUNTIF(J12:J17,\">0\"))","v":0},{"$f":"IF(I12>0,IF(K12+L12+M12=0,1,IF(ROUND((K12+L12)/(K12+L12+M12),4)>=0.5,1,ROUND((K12+L12)/(K12+L12+M12),4))),0)","v":0},{"$f":"IF(R12=0,0,ROUND(I12*J12*F12*G12*R12,2))","v":0},{"$f":"I12*J12*$L$3","v":0}]
[{"$f":"'Input Form'!E18","v":0},{"$f":"'Input Form'!F18","v":0},{"$f":"'Input Form'!B18","v":0},{"$f":"'Input Form'!C18","v":0},{"$f":"'Input Form'!D18","v":0},{"$f":"'Input Form'!L18","v":0},{"$f":"'Input Form'!N18","v":""},"0",{"$f":"'Input Form'!G18","v":0},{"$f":"'Input Form'!H18","v":0},{"$f":"'Input Form'!I18","v":0},{"$f":"'Input Form'!J18","v":0},{"$f":"'Input Form'!K18","v":0},"-","-","Total Tech Students",{"$f":"SUM(K12:K17)","v":0},{"$f":"IF(I13>0,IF(K13+L13+M13=0,1,IF(ROUND((K13+L13)/(K13+L13+M13),4)>=0.5,1,ROUND((K13+L13)/(K13+L13+M13),4))),0)","v":0},0,0]
[{"$f":"'Input Form'!E19","v":0},{"$f":"'Input Form'!F19","v":0},{"$f":"'Input Form'!B19","v":0},{"$f":"'Input Form'!C19","v":0},{"$f":"'Input Form'!D19","v":0},{"$f":"'Input Form'!L19","v":0},{"$f":"'Input Form'!N19","v":""},"0",{"$f":"'Input Form'!G19","v":0},{"$f":"'Input Form'!H19","v":0},{"$f":"'Input Form'!I19","v":0},{"$f":"'Input Form'!J19","v":0},{"$f":"'Input Form'!K19","v":0},"-","-","Total Non-Tech Students",{"$f":"SUM(M12:M17)","v":0},0,0,0]
[{"$f":"'Input Form'!E20","v":0},{"$f":"'Input Form'!F20","v":0},{"$f":"'Input Form'!B20","v":0},{"$f":"'Input Form'!C20","v":0},{"$f":"'Input Form'!D20","v":0},{"$f":"'Input Form'!L20","v":0},{"$f":"'Input Form'!N20","v":""},"0",{"$f":"'Input Form'!G20","v":0},{"$f":"'Input Form'!H20","v":0},{"$f":"'Input Form'!I20","v":0},{"$f":"'Input Form'!J20","v":0},{"$f":"'Input Form'!K20","v":0},"-","-","Rate",null,0,0,0]
[{"$f":"'Input Form'!E21","v":0},{"$f":"'Input Form'!F21","v":0},{"$f":"'Input Form'!B21","v":0},{"$f":"'Input Form'!C21","v":0},{"$f":"'Input Form'!D21","v":0},{"$f":"'Input Form'!L21","v":0},{"$f":"'Input Form'!N21","v":""},"0",{"$f":"'Input Form'!G21","v":0},{"$f":"'Input Form'!H21","v":0},{"$f":"'Input Form'!I21","v":0},{"$f":"'Input Form'!J21","v":0},{"$f":"'Input Form'!K21","v":0},"-","-","% Tech Students",{"$f":"IF(SUM(Q13:Q14)=0,0,Q13/SUM(Q13:Q14))","v":0},0,0,0,null,null,null,null,null,null,"Full Database Path"]
[{"$f":"'Input Form'!E22","v":0},{"$f":"'Input Form'!F22","v":0},{"$f":"'Input Form'!B22","v":0},{"$f":"'Input Form'!C22","v":0},{"$f":"'Input Form'!D22","v":0},{"$f":"'Input Form'!L22","v":0},{"$f":"'Input Form'!N22","v":""},"0",{"$f":"'Input Form'!G22","v":0},{"$f":"'Input Form'!H22","v":0},{"$f":"'Input Form'!I22","v":0},{"$f":"'Input Form'!J22","v":0},{"$f":"'Input Form'!K22","v":0},"-","-","Prelim-Reimb",{"$f":"IF(Q16>=0.5,Q11*Q10*Q12*Q15,Q11*Q12*Q15*Q16*Q10)","v":0},0,0,0,null,null,null,null,null,null,"Table Name"]
[{"$f":"'Input Form'!E23","v":0},{"$f":"'Input Form'!F23","v":0},{"$f":"'Input Form'!B23","v":0},{"$f":"'Input Form'!C23","v":0},{"$f":"'Input Form'!D23","v":0},{"$f":"'Input Form'!L23","v":0},{"$f":"'Input Form'!N23","v":""},"0",{"$f":"'Input Form'!G23","v":0},{"$f":"'Input Form'!H23","v":0},{"$f":"'Input Form'!I23","v":0},{"$f":"'Input Form'!J23","v":0},{"$f":"'Input Form'!K23","v":0},"-","-",null,null,0,0,0]
[{"$f":"'Input Form'!E24","v":0},{"$f":"'Input Form'!F24","v":0},{"$f":"'Input Form'!B24","v":0},{"$f":"'Input Form'!C24","v":0},{"$f":"'Input Form'!D24","v":0},{"$f":"'Input Form'!L24","v":0},{"$f":"'Input Form'!N24","v":""},"0",{"$f":"'Input Form'!G24","v":0},{"$f":"'Input Form'!H24","v":0},{"$f":"'Input Form'!I24","v":0},{"$f":"'Input Form'!J24","v":0},{"$f":"'Input Form'!K24","v":0},"-","-",null,null,0,0,0]
[{"$f":"'Input Form'!E25","v":0},{"$f":"'Input Form'!F25","v":0},{"$f":"'Input Form'!B25","v":0},{"$f":"'Input Form'!C25","v":0},{"$f":"'Input Form'!D25","v":0},{"$f":"'Input Form'!L25","v":0},{"$f":"'Input Form'!N25","v":""},"0",{"$f":"'Input Form'!G25","v":0},{"$f":"'Input Form'!H25","v":0},{"$f":"'Input Form'!I25","v":0},{"$f":"'Input Form'!J25","v":0},{"$f":"'Input Form'!K25","v":0},"-","-",null,null,0,0,0]
{"$rows_left_out":39}
{"sheet":"Lists","index":3,"n_rows":179,"n_cols":14,"rows_kept":179,"cut":false,"hidden":true,"merged":[]}
[]
[]
[]
[]
["Entity",null,"District/Academy","LEA","SU","Technical Center","Fiscal Year","Sem","District","LEA","School Year","State Rate","Pay Type","Trip Type"]
["Sending School District",null,"Alburgh","T003","ADDISON CENTRAL SU","BARRE TECH CTR/SHS CAMPUS",null,"1","Alburgh","T003","2012-2013",2.38,"District Operated","1 Sending School to Tech Center"]
["Technical Center",null,"Arlington","T005","ADDISON NORTHEAST SU","BURLINGTON TECHNICAL CENTER",null,"2","Arlington","T005","2011-2012",2.33,"Reimbursement","2 Tech Center to Sending School"]
["Independent School",null,"Averill","T256","ADDISON NORTHWEST SU","CENTER FOR TECHNOLOGY ESSEX",null,null,"Bakersfield","T007",null,null,"Contract by Mile","3 Sending School to Satellite Program"]
[null,null,"Avery's Gore","T257","ADDISON RUTLAND SU","COLD HOLLOW CAREER CENTER",null,null,"Baltimore","T008",null,null,"Contract by trip","4 Satellite Program to Sending School"]
[null,null,"Bakersfield","T007","BARRE SU","GREEN MTN TECHNOLOGY/CAREER CTR",null,null,"Barnet","T010",null,null,null,"5 Tech Center to Satellite Program"]
[null,null,"Baltimore","T008","BATTENKILL VALLEY SU","HARTFORD AREA CAREER/TECH CTR",null,null,"Berkshire","T018",null,null,null,"6 Satellite Program to Tech Center"]
[null,null,"Barnet","T010","BENNINGTON RUTLAND SU","LYNDON INSTITUTE",null,null,"Bethel","T020"]
[null,null,"Bellows Falls UHSD","U027","BLUE MOUNTAIN SD","NORTH COUNTRY CAREER CTR",null,null,"Bloomfield","T021"]
[null,null,"Bellows Free Academy UHSD","U048","BURLINGTON SD","NORTHWEST TECHNICAL CENTER",null,null,"Brunswick","T035"]
[null,null,"Berkshire","T018","CALEDONIA CENTRAL SU","PATRICIA HANNAFORD CAREER CTR",null,null,"Burke","T036"]
[null,null,"Bethel","T020","CALEDONIA NORTH SU","RANDOLPH TECHNICAL CAREER CTR",null,null,"Burlington","T037"]
[null,null,"Black River UHSD","U039","CHITTENDEN CENTRAL SU","RIVER BEND CAREER AND TECH CTR",null,null,"Cabot","T038"]
[null,null,"Bloomfield","T021","CHITTENDEN EAST SU","RIVER VALLEY TECHNICAL CENTER",null,null,"Canaan","T041"]
[null,null,"Blue Mountain USD","U021","CHITTENDEN SOUTH SU","ST. JOHNSBURY ACADEMY",null,null,"Chelsea","T046"]
[null,null,"Brattleboro UHSD","U006","COLCHESTER SD","STAFFORD TECHNICAL CENTER",null,null,"Chittenden","T048"]
{"$rows_left_out":159}